BDBM50188927 CHEMBL385143::N-((S)-4-amino-1-(2,4-dichlorophenyl)butan-2-yl)-5-(2-(methylamino)pyrimidin-4-yl)thiophene-2-carboxamide
SMILES CNc1nccc(n1)-c1ccc(s1)C(=O)N[C@H](CCN)Cc1ccc(Cl)cc1Cl
InChI Key InChIKey=HSTXBCBDIYGWDE-CQSZACIVSA-N
Data  1 IC50
  Tab Delimited (TSV)   2D SDfile   Computed 3D by Vconf -m prep SDfile
Find this compound or compounds like it in BindingDB:
Activity Spreadsheet -- Enzyme Inhibition Constant Data from BindingDB
Found 1 hit for monomerid = 50188927
TargetRAC-gamma serine/threonine-protein kinase(Homo sapiens (Human))
Chiron
Curated by ChEMBL
LigandPNGBDBM50188927(CHEMBL385143 | N-((S)-4-amino-1-(2,4-dichloropheny...)
Affinity DataIC50:  27nM. Assay description: Inhibition of AKT3 in presence of 0.2 uM ATP
In DepthDetails ArticlePubMed